BDBM50143349 CHEMBL57635::N*1*,N*1*-Diethyl-N*4*-(2-trifluoromethyl-5,6,7,8-tetrahydro-quinolin-4-yl)-pentane-1,4-diamine
SMILES CCN(CC)CCCC(C)Nc1cc(nc2CCCCc12)C(F)(F)F
InChI Key InChIKey=PWHOMYJTIOOKRU-UHFFFAOYSA-N
Data  1 IC50
  Tab Delimited (TSV)   2D SDfile   Computed 3D by Vconf -m prep SDfile
Find this compound or compounds like it in BindingDB:
Activity Spreadsheet -- Enzyme Inhibition Constant Data from BindingDB
Found 1 hit for monomerid = 50143349
TargetVoltage-dependent calcium channel subunit alpha-2/delta-1(Homo sapiens (Human))
Merck Research Laboratories
Curated by ChEMBL
LigandPNGBDBM50143349(CHEMBL57635 | N*1*,N*1*-Diethyl-N*4*-(2-trifluorom...)
Affinity DataIC50: >1.00E+4nM. Assay description: Binding affinity towards alpha2-delta subunit of a voltage gated calcium channel using [3H]-gabapentin in human brain membrane (A710 membrane)
In DepthDetails ArticlePubMed